cancel
Showing results for 
Search instead for 
Did you mean: 

Cannot install any patches magento 1.9.1.1

SOLVED

Cannot install any patches magento 1.9.1.1

Hey guys,

 

I'm having a major issue where I want to install the latest patch SUPEE-7405, however I cant seem to install that or any other patches for my version except SUPEE-6237+SUPEE-6482. I saw that SUPEE-7405 required the patches from 5994 and up, so I decided to give it a shot. 

 

SUPEE-5904 - Failed

http://pastebin.com/raw/z1DSXVYV

 

SUPEE-6285 - Failed

http://pastebin.com/raw/P4i3zDxY 

 

 

SUPEE-6788 - Failed

http://pastebin.com/raw/ehcXMhD8

 

SUPEE-7505 - Failed (Probably due to not having the previous patches): 

 

Checking if patch can be applied/reverted successfully...
ERROR: Patch can't be applied/reverted successfully.

patching file app/code/core/Mage/Admin/Model/Observer.php
patching file app/code/core/Mage/Admin/Model/Redirectpolicy.php
patching file app/code/core/Mage/Admin/Model/Resource/User.php
patching file app/code/core/Mage/Admin/Model/User.php
patching file app/code/core/Mage/Adminhtml/Block/Sales/Order/View/Tab/History.php
patching file app/code/core/Mage/Adminhtml/Block/Widget/Grid.php
patching file app/code/core/Mage/Adminhtml/Helper/Catalog/Product/Edit/Action/Attribute.php
patching file app/code/core/Mage/Adminhtml/Helper/Sales.php
patching file app/code/core/Mage/Adminhtml/Model/System/Config/Backend/File.php
patching file app/code/core/Mage/Adminhtml/Model/System/Config/Backend/Image.php
patching file app/code/core/Mage/Adminhtml/Model/System/Config/Backend/Image/Favicon.php
patching file app/code/core/Mage/Adminhtml/controllers/IndexController.php
The next patch would create the file app/code/core/Mage/Authorizenet/Helper/Admin.php,
which already exists!  Assume -R? [n]
Apply anyway? [n]
Skipping patch.
1 out of 1 hunk ignored
patching file app/code/core/Mage/Authorizenet/Helper/Data.php
patching file app/code/core/Mage/Authorizenet/controllers/Adminhtml/Authorizenet/Directpost/PaymentController.php
patching file app/code/core/Mage/Captcha/etc/config.xml
patching file app/code/core/Mage/Catalog/Block/Product/View/Options/Type/Select.php
patching file app/code/core/Mage/Catalog/Model/Category/Attribute/Backend/Image.php
patching file app/code/core/Mage/Catalog/Model/Resource/Product/Attribute/Backend/Image.php
patching file app/code/core/Mage/CatalogIndex/etc/config.xml
patching file app/code/core/Mage/CatalogInventory/Helper/Minsaleqty.php
patching file app/code/core/Mage/Checkout/Block/Cart/Item/Renderer.php
patching file app/code/core/Mage/Checkout/controllers/CartController.php
patching file app/code/core/Mage/Checkout/controllers/OnepageController.php
Hunk #1 FAILED at 102.
1 out of 1 hunk FAILED -- saving rejects to file app/code/core/Mage/Checkout/controllers/OnepageController.php.rej
patching file app/code/core/Mage/Core/Helper/Data.php
patching file app/code/core/Mage/Core/Model/App.php
patching file app/code/core/Mage/Core/Model/Config.php
patching file app/code/core/Mage/Core/Model/Email/Queue.php
patching file app/code/core/Mage/Core/Model/Email/Template/Filter.php
Hunk #1 FAILED at 171.
Hunk #2 succeeded at 182 (offset -10 lines).
1 out of 2 hunks FAILED -- saving rejects to file app/code/core/Mage/Core/Model/Email/Template/Filter.php.rej
The next patch would create the file app/code/core/Mage/Core/Model/File/Validator/Image.php,
which already exists!  Assume -R? [n]
Apply anyway? [n]
Skipping patch.
1 out of 1 hunk ignored
patching file app/code/core/Mage/Core/Model/Input/Filter/MaliciousCode.php
patching file app/code/core/Mage/Core/Model/Session.php
patching file app/code/core/Mage/Customer/controllers/AccountController.php
Hunk #1 succeeded at 65 (offset -3 lines).
patching file app/code/core/Mage/Dataflow/Model/Convert/Parser/Csv.php
Hunk #2 FAILED at 264.
1 out of 2 hunks FAILED -- saving rejects to file app/code/core/Mage/Dataflow/Model/Convert/Parser/Csv.php.rej
patching file app/code/core/Mage/Downloadable/controllers/CustomerController.php
patching file app/code/core/Mage/ImportExport/Model/Export/Adapter/Abstract.php
patching file app/code/core/Mage/ImportExport/Model/Export/Adapter/Csv.php
Hunk #2 FAILED at 118.
Hunk #3 succeeded at 121 (offset -12 lines).
1 out of 3 hunks FAILED -- saving rejects to file app/code/core/Mage/ImportExport/Model/Export/Adapter/Csv.php.rej
patching file app/code/core/Mage/ImportExport/Model/Import/Entity/Abstract.php
patching file app/code/core/Mage/ImportExport/etc/config.xml
The next patch would create the file app/code/core/Mage/ImportExport/etc/system.xml,
which already exists!  Assume -R? [n]
Apply anyway? [n]
Skipping patch.
1 out of 1 hunk ignored
patching file app/code/core/Mage/Newsletter/Model/Observer.php
patching file app/code/core/Mage/Newsletter/Model/Queue.php
patching file app/code/core/Mage/Page/etc/system.xml
patching file app/code/core/Mage/Paypal/controllers/PayflowController.php
patching file app/code/core/Mage/Paypal/controllers/PayflowadvancedController.php
patching file app/code/core/Mage/Paypal/etc/config.xml
patching file app/code/core/Mage/Persistent/etc/config.xml
patching file app/code/core/Mage/Review/controllers/ProductController.php
patching file app/code/core/Mage/Rss/Block/Catalog/Salesrule.php
patching file app/code/core/Mage/Rss/Helper/Order.php
patching file app/code/core/Mage/Sales/Helper/Guest.php
patching file app/code/core/Mage/Sales/Model/Quote/Address.php
patching file app/code/core/Mage/Sales/Model/Quote/Item.php
The next patch would create the file app/code/core/Zend/Xml/Security.php,
which already exists!  Assume -R? [n]
Apply anyway? [n]
Skipping patch.
1 out of 1 hunk ignored
patching file app/design/adminhtml/default/default/template/authorizenet/directpost/iframe.phtml
patching file app/design/adminhtml/default/default/template/bundle/sales/creditmemo/create/items/renderer.phtml
patching file app/design/adminhtml/default/default/template/bundle/sales/creditmemo/view/items/renderer.phtml
patching file app/design/adminhtml/default/default/template/bundle/sales/invoice/create/items/renderer.phtml
patching file app/design/adminhtml/default/default/template/bundle/sales/invoice/view/items/renderer.phtml
patching file app/design/adminhtml/default/default/template/bundle/sales/order/view/items/renderer.phtml
patching file app/design/adminhtml/default/default/template/bundle/sales/shipment/create/items/renderer.phtml
patching file app/design/adminhtml/default/default/template/bundle/sales/shipment/view/items/renderer.phtml
patching file app/design/adminhtml/default/default/template/catalog/product/composite/fieldset/options/type/file.phtml
patching file app/design/adminhtml/default/default/template/downloadable/sales/items/column/downloadable/creditmemo/name.phtml
patching file app/design/adminhtml/default/default/template/downloadable/sales/items/column/downloadable/invoice/name.phtml
patching file app/design/adminhtml/default/default/template/downloadable/sales/items/column/downloadable/name.phtml
patching file app/design/adminhtml/default/default/template/sales/items/column/name.phtml
patching file app/design/adminhtml/default/default/template/sales/items/renderer/default.phtml
patching file app/design/adminhtml/default/default/template/sales/order/totals/discount.phtml
patching file app/design/adminhtml/default/default/template/sales/order/view/info.phtml
patching file app/design/frontend/base/default/template/catalog/product/view/options/type/file.phtml
patching file app/design/frontend/base/default/template/rss/order/details.phtml
patching file lib/Varien/File/Uploader.php
patching file lib/Varien/Io/File.php
Hunk #1 FAILED at 227.
1 out of 1 hunk FAILED -- saving rejects to file lib/Varien/Io/File.php.rej
[blupackc@sipau1-06 public_html]$ clear
[blupackc@sipau1-06 public_html]$ sh PATCH_SUPEE-7405_CE_1.9.1.1_v1-2016-01-20-04-42-03.sh
Checking if patch can be applied/reverted successfully...
ERROR: Patch can't be applied/reverted successfully.

patching file app/code/core/Mage/Admin/Model/Observer.php
patching file app/code/core/Mage/Admin/Model/Redirectpolicy.php
patching file app/code/core/Mage/Admin/Model/Resource/User.php
patching file app/code/core/Mage/Admin/Model/User.php
patching file app/code/core/Mage/Adminhtml/Block/Sales/Order/View/Tab/History.php
patching file app/code/core/Mage/Adminhtml/Block/Widget/Grid.php
patching file app/code/core/Mage/Adminhtml/Helper/Catalog/Product/Edit/Action/Attribute.php
patching file app/code/core/Mage/Adminhtml/Helper/Sales.php
patching file app/code/core/Mage/Adminhtml/Model/System/Config/Backend/File.php
patching file app/code/core/Mage/Adminhtml/Model/System/Config/Backend/Image.php
patching file app/code/core/Mage/Adminhtml/Model/System/Config/Backend/Image/Favicon.php
patching file app/code/core/Mage/Adminhtml/controllers/IndexController.php
The next patch would create the file app/code/core/Mage/Authorizenet/Helper/Admin.php,
which already exists!  Assume -R? [n]
Apply anyway? [n]
Skipping patch.
1 out of 1 hunk ignored
patching file app/code/core/Mage/Authorizenet/Helper/Data.php
patching file app/code/core/Mage/Authorizenet/controllers/Adminhtml/Authorizenet/Directpost/PaymentController.php
patching file app/code/core/Mage/Captcha/etc/config.xml
patching file app/code/core/Mage/Catalog/Block/Product/View/Options/Type/Select.php
patching file app/code/core/Mage/Catalog/Model/Category/Attribute/Backend/Image.php
patching file app/code/core/Mage/Catalog/Model/Resource/Product/Attribute/Backend/Image.php
patching file app/code/core/Mage/CatalogIndex/etc/config.xml
patching file app/code/core/Mage/CatalogInventory/Helper/Minsaleqty.php
patching file app/code/core/Mage/Checkout/Block/Cart/Item/Renderer.php
patching file app/code/core/Mage/Checkout/controllers/CartController.php
patching file app/code/core/Mage/Checkout/controllers/OnepageController.php
Hunk #1 FAILED at 102.
1 out of 1 hunk FAILED -- saving rejects to file app/code/core/Mage/Checkout/controllers/OnepageController.php.rej
patching file app/code/core/Mage/Core/Helper/Data.php
patching file app/code/core/Mage/Core/Model/App.php
patching file app/code/core/Mage/Core/Model/Config.php
patching file app/code/core/Mage/Core/Model/Email/Queue.php
patching file app/code/core/Mage/Core/Model/Email/Template/Filter.php
Hunk #1 FAILED at 171.
Hunk #2 succeeded at 182 (offset -10 lines).
1 out of 2 hunks FAILED -- saving rejects to file app/code/core/Mage/Core/Model/Email/Template/Filter.php.rej
The next patch would create the file app/code/core/Mage/Core/Model/File/Validator/Image.php,
which already exists!  Assume -R? [n]
Apply anyway? [n]
Skipping patch.
1 out of 1 hunk ignored
patching file app/code/core/Mage/Core/Model/Input/Filter/MaliciousCode.php
patching file app/code/core/Mage/Core/Model/Session.php
patching file app/code/core/Mage/Customer/controllers/AccountController.php
Hunk #1 succeeded at 65 (offset -3 lines).
patching file app/code/core/Mage/Dataflow/Model/Convert/Parser/Csv.php
Hunk #2 FAILED at 264.
1 out of 2 hunks FAILED -- saving rejects to file app/code/core/Mage/Dataflow/Model/Convert/Parser/Csv.php.rej
patching file app/code/core/Mage/Downloadable/controllers/CustomerController.php
patching file app/code/core/Mage/ImportExport/Model/Export/Adapter/Abstract.php
patching file app/code/core/Mage/ImportExport/Model/Export/Adapter/Csv.php
Hunk #2 FAILED at 118.
Hunk #3 succeeded at 121 (offset -12 lines).
1 out of 3 hunks FAILED -- saving rejects to file app/code/core/Mage/ImportExport/Model/Export/Adapter/Csv.php.rej
patching file app/code/core/Mage/ImportExport/Model/Import/Entity/Abstract.php
patching file app/code/core/Mage/ImportExport/etc/config.xml
The next patch would create the file app/code/core/Mage/ImportExport/etc/system.xml,
which already exists!  Assume -R? [n]
Apply anyway? [n]
Skipping patch.
1 out of 1 hunk ignored
patching file app/code/core/Mage/Newsletter/Model/Observer.php
patching file app/code/core/Mage/Newsletter/Model/Queue.php
patching file app/code/core/Mage/Page/etc/system.xml
patching file app/code/core/Mage/Paypal/controllers/PayflowController.php
patching file app/code/core/Mage/Paypal/controllers/PayflowadvancedController.php
patching file app/code/core/Mage/Paypal/etc/config.xml
patching file app/code/core/Mage/Persistent/etc/config.xml
patching file app/code/core/Mage/Review/controllers/ProductController.php
patching file app/code/core/Mage/Rss/Block/Catalog/Salesrule.php
patching file app/code/core/Mage/Rss/Helper/Order.php
patching file app/code/core/Mage/Sales/Helper/Guest.php
patching file app/code/core/Mage/Sales/Model/Quote/Address.php
patching file app/code/core/Mage/Sales/Model/Quote/Item.php
The next patch would create the file app/code/core/Zend/Xml/Security.php,
which already exists!  Assume -R? [n]
Apply anyway? [n]
Skipping patch.
1 out of 1 hunk ignored
patching file app/design/adminhtml/default/default/template/authorizenet/directpost/iframe.phtml
patching file app/design/adminhtml/default/default/template/bundle/sales/creditmemo/create/items/renderer.phtml
patching file app/design/adminhtml/default/default/template/bundle/sales/creditmemo/view/items/renderer.phtml
patching file app/design/adminhtml/default/default/template/bundle/sales/invoice/create/items/renderer.phtml
patching file app/design/adminhtml/default/default/template/bundle/sales/invoice/view/items/renderer.phtml
patching file app/design/adminhtml/default/default/template/bundle/sales/order/view/items/renderer.phtml
patching file app/design/adminhtml/default/default/template/bundle/sales/shipment/create/items/renderer.phtml
patching file app/design/adminhtml/default/default/template/bundle/sales/shipment/view/items/renderer.phtml
patching file app/design/adminhtml/default/default/template/catalog/product/composite/fieldset/options/type/file.phtml
patching file app/design/adminhtml/default/default/template/downloadable/sales/items/column/downloadable/creditmemo/name.phtml
patching file app/design/adminhtml/default/default/template/downloadable/sales/items/column/downloadable/invoice/name.phtml
patching file app/design/adminhtml/default/default/template/downloadable/sales/items/column/downloadable/name.phtml
patching file app/design/adminhtml/default/default/template/sales/items/column/name.phtml
patching file app/design/adminhtml/default/default/template/sales/items/renderer/default.phtml
patching file app/design/adminhtml/default/default/template/sales/order/totals/discount.phtml
patching file app/design/adminhtml/default/default/template/sales/order/view/info.phtml
patching file app/design/frontend/base/default/template/catalog/product/view/options/type/file.phtml
patching file app/design/frontend/base/default/template/rss/order/details.phtml
patching file lib/Varien/File/Uploader.php
patching file lib/Varien/Io/File.php
Hunk #1 FAILED at 227.
1 out of 1 hunk FAILED -- saving rejects to file lib/Varien/Io/File.php.rej

Sorry for the massive post, I've just tried a bunch of things all day that haven't worked. I'm not the first developer on the site and using the upgrade without ssh (e.g. copy and pasting the files) seems to break the main page of the site (so I'm really hoping the previous dev hasn't gone around modifying magento core files). 

 

Thanks guys!

5 REPLIES

Re: Cannot install any patches magento 1.9.1.1

Hi there,

 

I had the same problem with SUPEE 7405 with my website: http://1buy.vn - a Magento site 1.9.1.1

It showed:

Hunk #1 FAILED at 227.
1 out of 1 hunk FAILED -- saving rejects to file lib/Varien/Io/File.php.rej

What is that? How I can deal with ?

Thanks.

Donald

Re: Cannot install any patches magento 1.9.1.1

Hi @Matt8517, were you able to make any progress installing patches on your site?

--

Community Manager, Magento
Problem solved? Click Accept as Solution!
Still stuck? Check out our documentation: https://magento.com/resources/technical

Re: Cannot install any patches magento 1.9.1.1

Hi @Donald20152016, please start a new thread and share the details that appear when the hunk fails as it will help troubleshoot the issue.

--

Community Manager, Magento
Problem solved? Click Accept as Solution!
Still stuck? Check out our documentation: https://magento.com/resources/technical

Re: Cannot install any patches magento 1.9.1.1

 @sherrie I essentially just re-installed everything on a fresh install and transferred the database over. I couldn't find any other way around it.

Re: Cannot install any patches magento 1.9.1.1

Hi Sherrie,

 

Thanks so much for your advise.

 

Now I got it, and already installed new fresh 1.9.2.2 version (installing by upload via FTP the fresh 1.9.2.2).

But my site (in admin) http://1buy.vn it still shows 1.9.1.1.

 

Thanks for any helps in advance.

Donald