cancel
Showing results for 
Search instead for 
Did you mean: 

PATCH-7405 fails on Magento 1.7.0.2

SOLVED

PATCH-7405 fails on Magento 1.7.0.2

PATCH-7405 fails on every Magento 1.7.0.2 install. Is there an update yet?

 

Checking if patch can be applied/reverted successfully...
ERROR: Patch can't be applied/reverted successfully.

checking file app/code/core/Mage/Admin/Model/Observer.php
checking file app/code/core/Mage/Admin/Model/Redirectpolicy.php
checking file app/code/core/Mage/Admin/Model/Resource/User.php
checking file app/code/core/Mage/Admin/Model/Session.php
checking file app/code/core/Mage/Admin/Model/User.php
checking file app/code/core/Mage/Adminhtml/Block/Sales/Order/View/Tab/History.php
checking file app/code/core/Mage/Adminhtml/Block/Widget/Grid.php
checking file app/code/core/Mage/Adminhtml/Helper/Catalog/Product/Edit/Action/Attribute.php
checking file app/code/core/Mage/Adminhtml/Helper/Sales.php
checking file app/code/core/Mage/Adminhtml/Model/System/Config/Backend/File.php
checking file app/code/core/Mage/Adminhtml/Model/System/Config/Backend/Image.php
checking file app/code/core/Mage/Adminhtml/Model/System/Config/Backend/Image/Favicon.php
checking file app/code/core/Mage/Adminhtml/controllers/IndexController.php
checking file app/code/core/Mage/Authorizenet/Helper/Admin.php
checking file app/code/core/Mage/Authorizenet/Helper/Data.php
checking file app/code/core/Mage/Authorizenet/controllers/Adminhtml/Authorizenet/Directpost/PaymentController.php
checking file app/code/core/Mage/Captcha/etc/config.xml
checking file app/code/core/Mage/Catalog/Block/Product/View/Options/Type/Select.php
checking file app/code/core/Mage/Catalog/Model/Category/Attribute/Backend/Image.php
checking file app/code/core/Mage/Catalog/Model/Resource/Product/Attribute/Backend/Image.php
checking file app/code/core/Mage/CatalogIndex/etc/config.xml
checking file app/code/core/Mage/CatalogInventory/Helper/Minsaleqty.php
checking file app/code/core/Mage/Checkout/Block/Cart/Item/Renderer.php
checking file app/code/core/Mage/Checkout/controllers/CartController.php
Hunk #2 succeeded at 453 (offset 1 line).
checking file app/code/core/Mage/Checkout/controllers/OnepageController.php
checking file app/code/core/Mage/Core/Controller/Response/Http.php
checking file app/code/core/Mage/Core/Helper/Data.php
checking file app/code/core/Mage/Core/Model/App.php
checking file app/code/core/Mage/Core/Model/Config.php
checking file app/code/core/Mage/Core/Model/Email/Template/Filter.php
Hunk #1 FAILED at 166.
Hunk #2 succeeded at 177 (offset -10 lines).
1 out of 2 hunks FAILED
checking file app/code/core/Mage/Core/Model/Factory.php
checking file app/code/core/Mage/Core/Model/File/Validator/Image.php
checking file app/code/core/Mage/Core/Model/Input/Filter/MaliciousCode.php
checking file app/code/core/Mage/Core/Model/Session.php
checking file app/code/core/Mage/Customer/controllers/AccountController.php
Hunk #1 succeeded at 65 (offset -3 lines).
checking file app/code/core/Mage/Dataflow/Model/Convert/Parser/Csv.php
checking file app/code/core/Mage/Downloadable/controllers/CustomerController.php
checking file app/code/core/Mage/ImportExport/Model/Export/Adapter/Abstract.php
checking file app/code/core/Mage/ImportExport/Model/Export/Adapter/Csv.php
checking file app/code/core/Mage/ImportExport/Model/Import/Entity/Abstract.php
checking file app/code/core/Mage/ImportExport/etc/config.xml
checking file app/code/core/Mage/ImportExport/etc/system.xml
checking file app/code/core/Mage/Newsletter/Model/Observer.php
checking file app/code/core/Mage/Newsletter/Model/Queue.php
checking file app/code/core/Mage/Page/etc/system.xml
checking file app/code/core/Mage/Paypal/controllers/PayflowController.php
checking file app/code/core/Mage/Paypal/controllers/PayflowadvancedController.php
checking file app/code/core/Mage/Paypal/etc/config.xml
checking file app/code/core/Mage/Persistent/etc/config.xml
checking file app/code/core/Mage/Review/controllers/ProductController.php
checking file app/code/core/Mage/Rss/Block/Catalog/Salesrule.php
checking file app/code/core/Mage/Sales/Helper/Guest.php
checking file app/code/core/Mage/Sales/Model/Quote/Address.php
checking file app/code/core/Mage/Sales/Model/Quote/Item.php
can't find file to patch at input line 2293
Perhaps you used the wrong -p or --strip option?
The text leading up to this was:
--------------------------
|diff --git app/code/core/Zend/Xml/Security.php app/code/core/Zend/Xml/Security.php
|index a3cdbc8..8b697b9 100644
|--- app/code/core/Zend/Xml/Security.php
|+++ app/code/core/Zend/Xml/Security.php
--------------------------
File to patch:
Skip this patch? [y]
Skipping patch.
3 out of 3 hunks ignored
checking file app/design/adminhtml/default/default/template/authorizenet/directpost/iframe.phtml
checking file app/design/adminhtml/default/default/template/bundle/sales/creditmemo/create/items/renderer.phtml
checking file app/design/adminhtml/default/default/template/bundle/sales/creditmemo/view/items/renderer.phtml
checking file app/design/adminhtml/default/default/template/bundle/sales/invoice/create/items/renderer.phtml
checking file app/design/adminhtml/default/default/template/bundle/sales/invoice/view/items/renderer.phtml
checking file app/design/adminhtml/default/default/template/bundle/sales/order/view/items/renderer.phtml
checking file app/design/adminhtml/default/default/template/bundle/sales/shipment/create/items/renderer.phtml
checking file app/design/adminhtml/default/default/template/bundle/sales/shipment/view/items/renderer.phtml
checking file app/design/adminhtml/default/default/template/catalog/product/composite/fieldset/options/type/file.phtml
checking file app/design/adminhtml/default/default/template/downloadable/sales/items/column/downloadable/creditmemo/name.phtml
checking file app/design/adminhtml/default/default/template/downloadable/sales/items/column/downloadable/invoice/name.phtml
checking file app/design/adminhtml/default/default/template/downloadable/sales/items/column/downloadable/name.phtml
checking file app/design/adminhtml/default/default/template/sales/items/column/name.phtml
checking file app/design/adminhtml/default/default/template/sales/items/renderer/default.phtml
checking file app/design/adminhtml/default/default/template/sales/order/totals/discount.phtml
checking file app/design/adminhtml/default/default/template/sales/order/view/info.phtml
checking file app/design/frontend/base/default/template/catalog/product/view/options/type/file.phtml
checking file app/design/frontend/base/default/template/rss/order/details.phtml
checking file lib/Varien/File/Uploader.php
checking file lib/Varien/Io/File.php
6 REPLIES

Re: PATCH-7405 fails on Magento 1.7.0.2

I'm also encountering this issue. Magento Version 1.7.0.1

 

Checking if patch can be applied/reverted successfully...
ERROR: Patch can't be applied/reverted successfully.

checking file app/code/core/Mage/Admin/Model/Observer.php
checking file app/code/core/Mage/Admin/Model/Redirectpolicy.php
checking file app/code/core/Mage/Admin/Model/Resource/User.php
checking file app/code/core/Mage/Admin/Model/Session.php
checking file app/code/core/Mage/Admin/Model/User.php
checking file app/code/core/Mage/Adminhtml/Block/Sales/Order/View/Tab/History.php
checking file app/code/core/Mage/Adminhtml/Block/Widget/Grid.php
checking file app/code/core/Mage/Adminhtml/Helper/Catalog/Product/Edit/Action/Attribute.php
checking file app/code/core/Mage/Adminhtml/Helper/Sales.php
checking file app/code/core/Mage/Adminhtml/Model/System/Config/Backend/File.php
checking file app/code/core/Mage/Adminhtml/Model/System/Config/Backend/Image.php
checking file app/code/core/Mage/Adminhtml/Model/System/Config/Backend/Image/Favicon.php
checking file app/code/core/Mage/Adminhtml/controllers/IndexController.php
checking file app/code/core/Mage/Authorizenet/Helper/Admin.php
checking file app/code/core/Mage/Authorizenet/Helper/Data.php
checking file app/code/core/Mage/Authorizenet/controllers/Adminhtml/Authorizenet/Directpost/PaymentController.php
checking file app/code/core/Mage/Captcha/etc/config.xml
checking file app/code/core/Mage/Catalog/Block/Product/View/Options/Type/Select.php
checking file app/code/core/Mage/Catalog/Model/Category/Attribute/Backend/Image.php
checking file app/code/core/Mage/Catalog/Model/Resource/Product/Attribute/Backend/Image.php
checking file app/code/core/Mage/CatalogIndex/etc/config.xml
checking file app/code/core/Mage/CatalogInventory/Helper/Minsaleqty.php
checking file app/code/core/Mage/Checkout/Block/Cart/Item/Renderer.php
checking file app/code/core/Mage/Checkout/controllers/CartController.php
checking file app/code/core/Mage/Checkout/controllers/OnepageController.php
checking file app/code/core/Mage/Core/Controller/Response/Http.php
checking file app/code/core/Mage/Core/Helper/Data.php
checking file app/code/core/Mage/Core/Model/App.php
checking file app/code/core/Mage/Core/Model/Config.php
checking file app/code/core/Mage/Core/Model/Email/Template/Filter.php
Hunk #1 FAILED at 166.
Hunk #2 succeeded at 177 (offset -10 lines).
1 out of 2 hunks FAILED
checking file app/code/core/Mage/Core/Model/Factory.php
checking file app/code/core/Mage/Core/Model/File/Validator/Image.php
checking file app/code/core/Mage/Core/Model/Input/Filter/MaliciousCode.php
checking file app/code/core/Mage/Core/Model/Session.php
checking file app/code/core/Mage/Customer/controllers/AccountController.php
Hunk #1 succeeded at 65 (offset -3 lines).
checking file app/code/core/Mage/Dataflow/Model/Convert/Parser/Csv.php
checking file app/code/core/Mage/Downloadable/controllers/CustomerController.php
checking file app/code/core/Mage/ImportExport/Model/Export/Adapter/Abstract.php
checking file app/code/core/Mage/ImportExport/Model/Export/Adapter/Csv.php
checking file app/code/core/Mage/ImportExport/Model/Import/Entity/Abstract.php
checking file app/code/core/Mage/ImportExport/etc/config.xml
checking file app/code/core/Mage/ImportExport/etc/system.xml
checking file app/code/core/Mage/Newsletter/Model/Observer.php
checking file app/code/core/Mage/Newsletter/Model/Queue.php
checking file app/code/core/Mage/Page/etc/system.xml
checking file app/code/core/Mage/Paypal/controllers/PayflowController.php
checking file app/code/core/Mage/Paypal/controllers/PayflowadvancedController.php
checking file app/code/core/Mage/Paypal/etc/config.xml
checking file app/code/core/Mage/Persistent/etc/config.xml
checking file app/code/core/Mage/Review/controllers/ProductController.php
checking file app/code/core/Mage/Rss/Block/Catalog/Salesrule.php
checking file app/code/core/Mage/Sales/Helper/Guest.php
checking file app/code/core/Mage/Sales/Model/Quote/Address.php
checking file app/code/core/Mage/Sales/Model/Quote/Item.php
can't find file to patch at input line 2293
Perhaps you used the wrong -p or --strip option?
The text leading up to this was:
--------------------------
|diff --git app/code/core/Zend/Xml/Security.php app/code/core/Zend/Xml/Security.php
|index a3cdbc8..8b697b9 100644
|--- app/code/core/Zend/Xml/Security.php
|+++ app/code/core/Zend/Xml/Security.php
--------------------------
File to patch: 
Skip this patch? [y] 
Skipping patch.
3 out of 3 hunks ignored
checking file app/design/adminhtml/default/default/template/authorizenet/directpost/iframe.phtml
checking file app/design/adminhtml/default/default/template/bundle/sales/creditmemo/create/items/renderer.phtml
checking file app/design/adminhtml/default/default/template/bundle/sales/creditmemo/view/items/renderer.phtml
checking file app/design/adminhtml/default/default/template/bundle/sales/invoice/create/items/renderer.phtml
checking file app/design/adminhtml/default/default/template/bundle/sales/invoice/view/items/renderer.phtml
checking file app/design/adminhtml/default/default/template/bundle/sales/order/view/items/renderer.phtml
checking file app/design/adminhtml/default/default/template/bundle/sales/shipment/create/items/renderer.phtml
checking file app/design/adminhtml/default/default/template/bundle/sales/shipment/view/items/renderer.phtml
checking file app/design/adminhtml/default/default/template/catalog/product/composite/fieldset/options/type/file.phtml
checking file app/design/adminhtml/default/default/template/downloadable/sales/items/column/downloadable/creditmemo/name.phtml
checking file app/design/adminhtml/default/default/template/downloadable/sales/items/column/downloadable/invoice/name.phtml
checking file app/design/adminhtml/default/default/template/downloadable/sales/items/column/downloadable/name.phtml
checking file app/design/adminhtml/default/default/template/sales/items/column/name.phtml
checking file app/design/adminhtml/default/default/template/sales/items/renderer/default.phtml
checking file app/design/adminhtml/default/default/template/sales/order/totals/discount.phtml
checking file app/design/adminhtml/default/default/template/sales/order/view/info.phtml
checking file app/design/frontend/base/default/template/catalog/product/view/options/type/file.phtml
checking file app/design/frontend/base/default/template/rss/order/details.phtml
checking file lib/Varien/File/Uploader.php
checking file lib/Varien/Io/File.php

Re: PATCH-7405 fails on Magento 1.7.0.2

Hi @jpi_cyberhouse & @ambimax, sorry for the delay in response, can you please confirm that you've installed all previous patches before applying 7405?

Also, what version of PHP are you running? 7405 is only compatible with 5.4+.

 

There's also a thread here that may help you troubleshoot: http://magento.stackexchange.com/questions/98220/security-patch-supee-7405-possible-problems/98236?s...

--

Community Manager, Magento
Problem solved? Click Accept as Solution!
Still stuck? Check out our documentation: https://magento.com/resources/technical

Re: PATCH-7405 fails on Magento 1.7.0.2

Hi Sherrie,

 

We're running PHP 5.4 and CE 1.7.0.2, but Patch 7405 still failed with the following output.  Any pointers?:

 

patching file app/code/core/Mage/Admin/Model/Observer.php
patching file app/code/core/Mage/Admin/Model/Redirectpolicy.php
patching file app/code/core/Mage/Admin/Model/Resource/User.php
patching file app/code/core/Mage/Admin/Model/Session.php
patching file app/code/core/Mage/Admin/Model/User.php
patching file app/code/core/Mage/Adminhtml/Block/Sales/Order/View/Tab/History.php
Hunk #1 FAILED at 187.
1 out of 1 hunk FAILED -- saving rejects to file app/code/core/Mage/Adminhtml/Block/Sales/Order/View/Tab/History.php.rej
patching file app/code/core/Mage/Adminhtml/Block/Widget/Grid.php
patching file app/code/core/Mage/Adminhtml/Helper/Catalog/Product/Edit/Action/Attribute.php
patching file app/code/core/Mage/Adminhtml/Helper/Sales.php
Hunk #1 succeeded at 134 with fuzz 2 (offset 24 lines).
patching file app/code/core/Mage/Adminhtml/Model/System/Config/Backend/File.php
Hunk #3 succeeded at 205 (offset 3 lines).

...

patching file lib/Varien/File/Uploader.php
patching file lib/Varien/Io/File.php
Hunk #1 FAILED at 227.
1 out of 1 hunk FAILED -- saving rejects to file lib/Varien/Io/File.php.rej

 

Re: PATCH-7405 fails on Magento 1.7.0.2

Hi @Ali_J, can you please confirm that you've installed all previous patches including 6788? Also, have you modified any of the core files the patch is getting stuck at?

--

Community Manager, Magento
Problem solved? Click Accept as Solution!
Still stuck? Check out our documentation: https://magento.com/resources/technical

Re: PATCH-7405 fails on Magento 1.7.0.2

Hi Sherrie,

 

All previous patches were already installed including 6788, and no changes were made to the core files.

 

Here's the list of installed patches if it helps:

SUPEE-5345
SUPEE-5994
SUPEE-6285 SUPEE-6482 SUPEE-6788

 

Thanks,

 

Re: PATCH-7405 fails on Magento 1.7.0.2

Thank you