Showing results for 
Search instead for 
Did you mean: 

SUPEE-6788 Magento Fails (Hunk #1 FAILED at 97.)

SUPEE-6788 Magento Fails (Hunk #1 FAILED at 97.)

SUPEE-6788 (what else Man Frustrated)


Got a dev copy of the site up and running and all previous patches applied.


checking file app/code/core/Mage/Adminhtml/controllers/Permissions/VariableController.php
checking file app/code/core/Mage/Adminhtml/etc/adminhtml.xml
checking file app/code/core/Mage/Catalog/Model/Product/Option/Type/File.php
checking file app/code/core/Mage/Core/Controller/Request/Http.php
Hunk #1 succeeded at 285 (offset -7 lines).
checking file app/code/core/Mage/Core/Controller/Varien/Router/Admin.php
Hunk #1 FAILED at 97.
1 out of 1 hunk FAILED
checking file app/code/core/Mage/Core/Helper/UnserializeArray.php
checking file app/code/core/Mage/Core/Model/Email/Template/Filter.php
checking file app/code/core/Mage/Core/Model/Resource/Setup.php
checking file app/code/core/Mage/Core/etc/config.xml
checking file app/code/core/Mage/Core/etc/system.xml

Cannot get passed this Hunk #1 FAILED at 97 message


The core/Mage folder  was previously updated with a clean set of files from a fresh download


The file exists:



Can anyone suggest anything else I can try.


Ive got SUPEE-6788 running already on 1.9, 1.7 etc, but this has me properly stuck